Planet Labs
definition: Planet was founded with the mission to image the Earth every day and make change visible, accessible, and actionable. Over the past decade with our customers, Planet has revolutionized the Earth observation industry, democratizing access to satellite data beyond the traditional agriculture and defense sectors.
type: Concept
in scheme: providers
change note: 2021-08-10 15:38:23.0 [mmorahan] insert AltLabel (id: null category: null text: Planet Labs language code: en); insert Definition (id: null text: Planet was founded with the mission to image the Earth every day and make change visible, accessible, and actionable. Over the past decade with our customers, Planet has revolutionized the Earth observation industry, democratizing access to satellite data beyond the traditional agriculture and defense sectors. language code: en); insert Resource (id: null type: provider url: https://www.planet.com/);
change note: 2021-08-10 15:34:42.0 [mmorahan] Insert Concept add broader relation (Planet Labs [28c18820-a23c-4f76-9538-2d4ed31e4db0,706578] - COMMERCIAL [1bb6821d-8534-40ce-a6ee-7c88ce4d3c9f,693042]);

COMMERCIAL
type: Concept