J-31
change note: 2021-11-17 09:46:48.0 [tstevens] Move Concepts delete broader relation (null); add broader relation (J-31 [293eba8a-cae4-4505-9c59-d1e223990ea4,826081] - Jet [5b8e4067-db4e-42d4-b4a5-7de5e683125d,835881]);
change note: 2020-05-22 12:51:59.0 [sritz] Insert Concept add broader relation (J-31 [293eba8a-cae4-4505-9c59-d1e223990ea4,560255] - Aircraft [227d9c3d-f631-402d-84ed-b8c5a562fc27,541399]);
change note: 2020-05-22 12:57:57.0 [sritz] insert AltLabel (id: null category: primary text: J-31 aircraft language code: en);
change note: 2020-05-22 12:59:18.0 [sritz] insert AltLabel (id: null category: null text: Jetstream 31 language code: en);
change note: 2021-11-17 09:46:40.0 [tstevens] Cut Concepts delete broader relation (null); add broader relation (J-31 [293eba8a-cae4-4505-9c59-d1e223990ea4,826081] - Trash Can/Platforms [6089b3e5-7db9-46e1-b73b-2d679f34abb4,831469]);
change note: 2022-02-17 09:10:49.0 [tstevens] update Definition (A Chinese prototype mid-sized twinjet 5th-generation fighter aircraft developed by Shenyang Aircraft Corporation (SAC).); update Definition ("China's second FC-31 takes flight". FlightGlobal. 2016-12-23. Archived from the original on 2018-12-24.);
change note: 2020-05-22 12:57:17.0 [sritz] insert Definition (id: null text: https://car.gsfc.nasa.gov/ language code: en);
change note: 2020-05-22 12:58:51.0 [sritz] insert AltLabel (id: null category: null text: British Aerospace Jetstream language code: en);
alternative label: British Aerospace Jetstream
alternative label: Jetstream 31
type: Concept
definition: A Chinese prototype mid-sized twinjet 5th-generation fighter aircraft developed by Shenyang Aircraft Corporation (SAC).
in scheme: platforms

Jet
type: Concept