TORNADOES
type: Concept

WATER SPOUT
change note: 2016-06-28 14:05:39.0 [saritz] insert Definition (id: null text: In general, any tornado over a body of water. language code: en);
change note: 2016-06-28 14:04:34.0 [saritz] Insert Concept add broader relation (WATER SPOUT [2992d7d3-5ae6-4844-b0fa-4ad348e3a8c2,217727] - TORNADOES [a200e677-384a-42d6-8519-1c7735f0adb9,84177]);
in scheme: sciencekeywords
definition: In general, any tornado over a body of water.
type: Concept