CA/NFLD/FISHAQ
in scheme: providers
definition: The Government of Newfoundland and Labrador's department of of Fisheries and Aquaculture provides a range of services and administers several programs such as fisheries development, marketing, vessels, facilities and aquaculture. Website: "http://www.gov.nf.ca/fishaq/" [Summary provided by Department of Fisheries and Aquaculture, Government of Newfoundland and Labrador, Canada]
type: Concept

CANADA
type: Concept