APLACOPHORANS
change note: 2017-03-09 15:44:53.0 [mgenazzi] Definition added insert Definition (id: null text: Molluscs deviated from the normal molluscan form with no shell and rudimentary body structure. language code: en);
in scheme: sciencekeywords
definition: Molluscs deviated from the normal molluscan form with no shell and rudimentary body structure.
type: Concept

MOLLUSKS
type: Concept