WATERSHED CHARACTERISTICS
type: Concept

WATERSHED SHAPE
change note: 2016-04-04 09:41:47.0 [gee-cee] update Definition (The watershed can vary from streams to many various cracks.);
change note: 2016-03-31 09:52:26.0 [gee-cee] insert Definition (id: null text: The watershed can vary from streams to many various cracks language code: en);
change note: 2016-03-31 09:52:06.0 [gee-cee] Insert Concept add broader relation (WATERSHED SHAPE [2b37d67c-92a6-4188-8f1b-4462bd754577,158767] - WATERSHED CHARACTERISTICS [c84b61fe-720a-4240-b6c8-8dcc9ae24a36,86191]);
in scheme: sciencekeywords
definition: The watershed can vary from streams to many various cracks.
type: Concept