TEMPORAL SUBSETTING
change note: 2020-05-21 11:35:04.0 [tstevens] Insert Concept add broader relation (TEMPORAL SUBSETTING [2b42bbe1-a87b-421b-b9cd-6eeb662eaa7e,560225] - SUBSETTING/SUPERSETTING [cc9e67fc-eafa-43cc-879f-0cb56b25bc39,84341]);
in scheme: sciencekeywords
definition: The process of selecting features of a spatial object based on time and time frequency. whether or not they in some way relate in space to another object.
type: Concept

SUBSETTING/SUPERSETTING
type: Concept