OCEAN WAVES
type: Concept

SEICHES
in scheme: sciencekeywords
definition: Pendulum-like rocking of water in an enclosed area; a form of standing wave that can be caused by meteorological or seismic forces, or that may result from normal resonances excited by tides.
type: Concept