UGA/CAES/ENTO
in scheme: providers
definition: The Department of Entomology offers a wide range of courses and research programs leading to the Master of Science and Doctor of Philosophy degrees. Our goal is to support and encourage students who are preparing for a career as a scientist in a federal, state, or industrial laboratory or in an academic institution, by providing them with as broad a background as possible in the many facets of insect biology. Programs within our Department encompass all levels of biological organization from the molecular level to ecosystems. In addition to training in modern methodologies of classical entomology, the Department has special emphasis areas in Insect/Plant Interactions, Biological Control, and Molecular Entomology. We take great pride in the progress and development of our students and the high quality of their research and publications. Website: http://entomology.ent.uga.edu/ [Summary provided by the University of Georgia.]
type: Concept

ACADEMIC
type: Concept