SOIL BULK DENSITY
change note: 2017-03-10 09:09:42.0 [tstevens] update Definition (The mass of dry soil per unit of bulk volume, including the air space.); update Definition (The Nature and Properties of Soils, Prentice Hall, 1996. );
in scheme: sciencekeywords
definition: The mass of dry soil per unit of bulk volume, including the air space.
type: Concept

SOILS
type: Concept