V - Z
type: Concept

WWLLN
in scheme: projects
definition: The World Wide Lightning Location Network is a global lightning network that detects the very low frequency (VLF; 3-30 kHz) emissions from lightning, known as sferics, that propagate long distances through the Earth-ionosphere waveguide. http://www.wwlln.net/
type: Concept