ESSA-7
change note: 2018-11-14 10:39:34.0 [sritz] insert AltLabel (id: null category: primary text: Environmental Science Services Administration Satellite 7 language code: en);
change note: 2018-10-30 13:04:01.0 [sritz] insert Definition (id: null text: The ESSA-7 satellite replaced ESSA-5 and provided cloud cover photography to the US's National Meteorological Center for the purpose of preparing operational weather analyses and forecasts. The spacecraft was an 18-sided polygon, 42 inches in diameter, 22 inches high and weighed 320 pounds. The craft was made of aluminum alloy and stainless steel then covered with 9100 solar cells. The solar cells served to charge the 63 nickel-cadmium batteries. The two cameras were mounted 180-degrees opposite each other along the side of the cylindrical craft. The "cartwheel" configuration of the TIROS-9 was selected as the orbital configuration of the operational series of ESSA satellites. Therefore, a camera could be pointed at some point on Earth every time the satellite rotated along its axis. The spacecraft operating system was the same as on the TIROS-9. The craft was placed in its planned Sun-synchronous 102-degree inclination retrograde orbit. The satellite spin axis was rotated using the magnetic attitude control system into an alignment perpendicular to the orbital plane and tangent to the Earth's surface. The ESSA-7 system transmitted images covering 2000-square mile areas with 2-mile resolution from every location once per day. Two arrays of radiometer sensors were also mounted 180-degrees apart to measure the global distribution of solar radiation reflected by the Earth and the Earth's atmosphere, as well as the long wave emissions from the Earth (a contribution from the NIMBUS program). ESSA-7 Stats: Launch Date: August 16, 1968 Operational Period: 571 days until deactivated by NASA on March 10, 1970 Launch Vehicle: Two stage long tank Delta Launch Site: Vandenberg Air Force Base, CA Type: Weather Satellite language code: en);
change note: 2018-11-14 10:40:00.0 [sritz] insert AltLabel (id: null category: null text: TOS-E language code: en);
change note: 2018-10-30 11:45:23.0 [sritz] Insert Concept add broader relation (ESSA-7 [2e4252b9-5b53-41bb-8212-1e63a540181f,368207] - ESSA [65cb3e7c-d4d8-46df-a5fc-aec63e58e8df,345109]);
definition: The ESSA-7 satellite replaced ESSA-5 and provided cloud cover photography to the US's National Meteorological Center for the purpose of preparing operational weather analyses and forecasts. The spacecraft was an 18-sided polygon, 42 inches in diameter, 22 inches high and weighed 320 pounds. The craft was made of aluminum alloy and stainless steel then covered with 9100 solar cells. The solar cells served to charge the 63 nickel-cadmium batteries. The two cameras were mounted 180-degrees opposite each other along the side of the cylindrical craft. The "cartwheel" configuration of the TIROS-9 was selected as the orbital configuration of the operational series of ESSA satellites. Therefore, a camera could be pointed at some point on Earth every time the satellite rotated along its axis. The spacecraft operating system was the same as on the TIROS-9. The craft was placed in its planned Sun-synchronous 102-degree inclination retrograde orbit. The satellite spin axis was rotated using the magnetic attitude control system into an alignment perpendicular to the orbital plane and tangent to the Earth's surface. The ESSA-7 system transmitted images covering 2000-square mile areas with 2-mile resolution from every location once per day. Two arrays of radiometer sensors were also mounted 180-degrees apart to measure the global distribution of solar radiation reflected by the Earth and the Earth's atmosphere, as well as the long wave emissions from the Earth (a contribution from the NIMBUS program). ESSA-7 Stats: Launch Date: August 16, 1968 Operational Period: 571 days until deactivated by NASA on March 10, 1970 Launch Vehicle: Two stage long tank Delta Launch Site: Vandenberg Air Force Base, CA Type: Weather Satellite
in scheme: platforms
type: Concept
alternative label: TOS-E

Environmental Science Services Administration (ESSA)
type: Concept