Earth Observation Satellites
type: Concept

GRACE
change note: 2018-03-13 14:28:47.0 [sritz] update Definition ([Source: NASA Science Mission Directorate, https://www.nasa.gov/mission_pages/Grace/ ] The primary goal of the GRACE mission is to accurately map variations in the Earth's gravity field over its 5-year lifetime. The GRACE mission has two identical spacecrafts flying about 220 kilometers apart in a polar orbit 500 kilometers above the Earth. It maps the Earth's gravity fields by making accurate measurements of the distance between the two satellites, using geodetic quality Global Positioning System (GPS) receivers and a microwave ranging system. This provides scientists from all over the world with an efficient and cost-effective way to map the Earth's gravity fields with unprecedented accuracy. The results from this mission yield crucial information about the distribution and flow of mass within the Earth and it's surroundings. The gravity variations that GRACE studies include: changes due to surface and deep currents in the ocean; runoff and ground water storage on land masses; exchanges between ice sheets or glaciers and the oceans; and variations of mass within the Earth. Another goal of the mission is to create a better profile of the Earth's atmosphere. The results from GRACE make a huge contribution to NASA's Earth science goals, Earth Observation System (EOS) and global climate change studies. GRACE is a joint partnership between the NASA in the United States and Deutsche Forschungsanstalt fur Luft und Raumfahrt (DLR) in Germany. Dr. Byron Tapley of The University of Texas Center for Space Research (UTCSR) is the Principal Investigator (PI), and Dr. Christoph Reigber of the GeoForschungsZentrum (GFZ) Potsdam is the Co-Principal Investigator (Co-PI). Project management and systems engineering activities are carried out by the Jet Propulsion Laboratory. Group: Platform_Details Entry_ID: GRACE Group: Platform_Identification Platform_Category: Earth Observation Satellites Short_Name: GRACE Long_Name: Gravity Recove…
change note: 2023-05-31 12:43:34.0 [tstevens] Move Concepts delete broader relation (null); add broader relation (GRACE [2e7aa2e6-9d25-4c6e-aef3-6e86d3773bac,1325599] - Earth Observation Satellites [3466eed1-2fbb-49bf-ab0b-dc08731d502b,1325625]);
change note: 2023-05-31 12:43:24.0 [tstevens] Cut Concepts delete broader relation (null); add broader relation (GRACE [2e7aa2e6-9d25-4c6e-aef3-6e86d3773bac,1325599] - Trash Can/Platforms [6089b3e5-7db9-46e1-b73b-2d679f34abb4,1331198]);
change note: 2020-01-02 17:45:11.0 [sritz] update Definition ([Source: NASA Science Mission Directorate, https://www.nasa.gov/mission_pages/Grace/ ] The primary goal of the GRACE mission is to accurately map variations in the Earth's gravity field over its 5-year lifetime. The GRACE mission has two identical spacecrafts flying about 220 kilometers apart in a polar orbit 500 kilometers above the Earth. It maps the Earth's gravity fields by making accurate measurements of the distance between the two satellites, using geodetic quality Global Positioning System (GPS) receivers and a microwave ranging system. This provides scientists from all over the world with an efficient and cost-effective way to map the Earth's gravity fields with unprecedented accuracy. The results from this mission yield crucial information about the distribution and flow of mass within the Earth and it's surroundings. The gravity variations that GRACE studies include: changes due to surface and deep currents in the ocean; runoff and ground water storage on land masses; exchanges between ice sheets or glaciers and the oceans; and variations of mass within the Earth. Another goal of the mission is to create a better profile of the Earth's atmosphere. The results from GRACE make a huge contribution to NASA's Earth science goals, Earth Observation System (EOS) and global climate change studies. GRACE is a joint partnership between the NASA in the United States and Deutsche Forschungsanstalt fur Luft und Raumfahrt (DLR) in Germany. Dr. Byron Tapley of The University of Texas Center for Space Research (UTCSR) is the Principal Investigator (PI), and Dr. Christoph Reigber of the GeoForschungsZentrum (GFZ) Potsdam is the Co-Principal Investigator (Co-PI). Project management and systems engineering activities are carried out by the Jet Propulsion Laboratory. Group: Platform_Details Entry_ID: GRACE Group: Platform_Identification Platform_Category: Earth Observation Satellites Short_Name: GRACE Long_Name: Gravity Recove…
definition: [Source: NASA Science Mission Directorate, https://www.nasa.gov/mission_pages/Grace/ ] The primary goal of the GRACE mission is to accurately map variations in the Earth's gravity field over its 5-year lifetime. The GRACE mission has two identical spacecrafts flying about 220 kilometers apart in a polar orbit 500 kilometers above the Earth. It maps the Earth's gravity fields by making accurate measurements of the distance between the two satellites, using geodetic quality Global Positioning System (GPS) receivers and a microwave ranging system. This provides scientists from all over the world with an efficient and cost-effective way to map the Earth's gravity fields with unprecedented accuracy. The results from this mission yield crucial information about the distribution and flow of mass within the Earth and it's surroundings. The gravity variations that GRACE studies include: changes due to surface and deep currents in the ocean; runoff and ground water storage on land masses; exchanges between ice sheets or glaciers and the oceans; and variations of mass within the Earth. Another goal of the mission is to create a better profile of the Earth's atmosphere. The results from GRACE make a huge contribution to NASA's Earth science goals, Earth Observation System (EOS) and global climate change studies. GRACE is a joint partnership between the NASA in the United States and Deutsche Forschungsanstalt fur Luft und Raumfahrt (DLR) in Germany. Dr. Byron Tapley of The University of Texas Center for Space Research (UTCSR) is the Principal Investigator (PI), and Dr. Christoph Reigber of the GeoForschungsZentrum (GFZ) Potsdam is the Co-Principal Investigator (Co-PI). Project management and systems engineering activities are carried out by the Jet Propulsion Laboratory. Group: Platform_Details Entry_ID: GRACE Group: Platform_Identification Platform_Category: Earth Observation Satellites Short_Name: GRACE Long_Name: Gravity Recovery and Climate Experiment End_Group Group: Platfo…
type: Concept
in scheme: platforms