SCATTEROMETERS
change note: 2021-08-04 17:19:51.0 [sritz] insert AltLabel (id: null category: primary text: SCATTEROMETERS language code: en);
in scheme: instruments
definition: A scatterometer transmits radar pulses and receives backscattered energy, the intensity of which depends on the roughness and dielectric properties of a particular target. Scatterometers were originally designed to measure oceanic surface winds, where the amount of backscatter depends on two factors the size of the surface ripples on the ocean, and their orientation with respect to the propagation direction of the pulse of radiation transmitted by the scatterometer. The first is dependent on wind stress and hence wind speed at the surface, while the second is related to wind direction. Hence measurements by such scatterometers may be used to derive both wind speed and direction. These instruments aim to achieve high accuracy measurements of wind vectors (speed and direction) and resolution is of secondary importance (they generally produce wind maps with a resolution of order 25-50km). Because scatterometers operate at microwave wavelengths, the measurements are available irrespective of weather conditions. Spaceborne scatterometers have provided continuous synoptic microwave coverage of the Earth for nearly a decade, starting with the ERS series, NSCAT on ADEOS, and more recently SeaWinds on QuikSCAT. The ERS and NSCAT instruments employed a fan-beam (multi-incidence) wind retrieval technique, whereas QuikSCAT employs a conically scanning (fixed incidence) technique. Increases in swath width capability of scatterometers now mean that a single instrument can provide around 90% coverage of global oceans on a daily basis. [Summary provided by CEOS.] Group: Instrument_Details Entry_ID: SCATTEROMETERS Group: Instrument_Identification Instrument_Category: Earth Remote Sensing Instruments Instrument_Class: Active Remote Sensing Instrument_Type: Scatterometers Short_Name: SCATTEROMETERS End_Group Online_Resource: http://www.eohandbook.com/eohb05/ceos/part3_1_pop13.html Creation_Date: 2007-09-12 End_Group
type: Concept

Scatterometers
type: Concept