ACADEMIC
type: Concept

TAMU/BAEN/DFS/SSL
in scheme: providers
definition: The Spatial Sciences Laboratory strives to develop and support excellence in research and teaching in areas of advanced spatial analysis, spatial data handling, Geographic Information Systems, Global Positioning Systems, and Remote Sensing. The lab applies spatial models, procedures, and processes to address natural resource issues. Our goal is to continue the tradition of making the laboratory a leader in the spatial sciences with a cutting edge computing facility. The SSL is a valuable asset in the fields of GIS, Remote Sensing, and GPS. For Texas A&M University and the State of Texas, it serves as an important node for interdisciplinary research, teaching, and community outreach. Website: http://www-ssl.tamu.edu/mission.html Info: The Spatial Sciences Laboratory
type: Concept