Models
type: Concept

NCEP-ETA
change note: 2022-03-11 13:43:51.0 [tstevens] insert Definition (id: null text: The Eta Model, now referred to as North Amercian Meso (NAM) an 84-hour numerical model of the atmosphere run four times daily by NCEP. This is one of the main forecast models used for short-term weather prediction in the United States. language code: en);
change note: 2015-08-10 14:49:54.0 [epneff] added long name update PrefLabel (NCEP-ETA);
change note: 2015-08-10 14:46:05.0 [epneff] added long name insert AltLabel (id: null text: NCEP Eta Model language code: en);
change note: 2015-08-10 14:45:43.0 [epneff] Insert Concept add broader relation (ETA [2ecfc2b9-118b-4462-9352-9193eef0a1dc,158227] - Models/Analyses [113ecbc2-ab36-4d58-a96c-a6ce0106e749,143215]);
change note: 2021-11-30 13:28:36.0 [tstevens] Move Concepts delete broader relation (null); add broader relation (NCEP-ETA [2ecfc2b9-118b-4462-9352-9193eef0a1dc,826099] - Models [0a184cdc-c074-4946-90a6-02f03c686341,835911]);
definition: The Eta Model, now referred to as North Amercian Meso (NAM) an 84-hour numerical model of the atmosphere run four times daily by NCEP. This is one of the main forecast models used for short-term weather prediction in the United States.
in scheme: platforms
type: Concept