Thermal/Radiation Detectors
type: Concept

ACTINOMETER
in scheme: instruments
definition: A ACTINOMETER is an instrument for measuring the intensity of electromagnetic radiation (usually by the photochemical effect)
type: Concept