GLACIAL RETREAT
change note: 2012-07-23 17:12:34.0 [mpmorahan] insert Definition (id: null text: A condition occurring when backward melting at the front of a glacier takes place at a rate exceeding forward motion. language code: en);
change note: 2012-06-26 14:31:04.0 [gee-cee] Insert Concept add broader relation (GLACIAL RETREAT [2f257f83-bddd-41ce-ac78-5dac857b1be3,39987] - LAND RECORDS [2bedb6b3-6e92-42e2-b382-60e2a6aab8e9,39979]);
in scheme: sciencekeywords
definition: A condition occurring when backward melting at the front of a glacier takes place at a rate exceeding forward motion.
type: Concept

LAND RECORDS
type: Concept