OXYGEN ISOTOPE ANALYSIS
change note: 2012-07-24 17:00:13.0 [mpmorahan] insert Definition (id: null text: A method of determining patterns of climatic change over long periods using the ratio of the stable oxygen isotopes 18O to 16O as an indicator of the amount of water locked up in ice-sheets and thus of global temperature. Sea water contains many isotopes of oxygen, the most common being 18O to 16O. During cold periods the glaciers grow, water is drawn up into them, and the proportion of 18O increases. When the ice-caps melt during periods of warm climate the proportion of 18O decreases. There are two ways of obtaining data about the 16O to 18O ratio, both using measurements made using a mass spectrometer. The first is to use cores from the polar ice-caps which preserve layers of snow ultimately made from sea water. The second is to use the skeletons of foraminifera preserved in ocean-bottom ooze because these marine fossils had the same 16O to 18O ratio as the sea water during the time they were alive. Using this data a series of at least eleven cycles of cooling and warming climatic conditions have been recognized in the northern hemisphere during the Pleistocene. language code: en);
change note: 2012-06-26 15:22:53.0 [gee-cee] Insert Concept add broader relation (OXYGEN ISOTOPE ANALYSIS [2f2d4df2-0701-4fe1-9d9b-e7e1c8678a8f,40079] - PALEOCLIMATE INDICATORS [c9a5b3eb-7556-41a8-a2b8-c015db80e5b2,39947]);
in scheme: sciencekeywords
definition: A method of determining patterns of climatic change over long periods using the ratio of the stable oxygen isotopes 18O to 16O as an indicator of the amount of water locked up in ice-sheets and thus of global temperature. Sea water contains many isotopes of oxygen, the most common being 18O to 16O. During cold periods the glaciers grow, water is drawn up into them, and the proportion of 18O increases. When the ice-caps melt during periods of warm climate the proportion of 18O decreases. There are two ways of obtaining data about the 16O to 18O ratio, both using measurements made using a mass spectrometer. The first is to use cores from the polar ice-caps which preserve layers of snow ultimately made from sea water. The second is to use the skeletons of foraminifera preserved in ocean-bottom ooze because these marine fossils had the same 16O to 18O ratio as the sea water during the time they were alive. Using this data a series of at least eleven cycles of cooling and warming climatic conditions have been recognized in the northern hemisphere during the Pleistocene.
type: Concept

PALEOCLIMATE INDICATORS
type: Concept