HARVARD/HUL
in scheme: providers
definition: This web site is an online gateway to the extraordinary library resources of Harvard University and serves as an important research tool for Harvard's current students, faculty, staff, and researchers who hold Harvard IDs and PINs. The site also provides practical information on each of the more than 80 libraries that form the Harvard system. Summary Provided By: http://lib.harvard.edu/
type: Concept

ACADEMIC
type: Concept