DOI/USGS/BRD/CERC/PUBS
change note: 2014-03-21 10:55:33.0 [epneff] updated website url update Definition (The Columbia Environmental Research Center in its publications section makes reference to peer-reviewed journal publications authored by past and present staff of the Columbia Environmental Research Center from 1947 to the present. Journal publications lists are organized by year of publication, with the newest publications first, then alphabetically by first author's name. Website: "http://www.cerc.usgs.gov/Publications.aspx?ContentId=331" [Summary provided by the USGS.]);
in scheme: providers
definition: The Columbia Environmental Research Center in its publications section makes reference to peer-reviewed journal publications authored by past and present staff of the Columbia Environmental Research Center from 1947 to the present. Journal publications lists are organized by year of publication, with the newest publications first, then alphabetically by first author's name. Website: "http://www.cerc.usgs.gov/Publications.aspx?ContentId=331" [Summary provided by the USGS.]
type: Concept

USGS
type: Concept