TROPOSPHERIC/HIGH-LEVEL CLOUDS (OBSERVED/ANALYZED)
type: Concept

PILEUS
change note: 2013-03-20 16:18:49.0 [mpmorahan] insert Definition (id: null text: "Appearance: Resembles the top of a mushroom or a smooth cap. Occurrence: Occasional. Found above rapidly growing cumulus or cumulonimbus clouds as a result of warm updrafts formed during a thunderstorm. Conditions: Caused by rapid, relatively strong, upward movements of warm moist air, which acts as a barrier. Air approaching the top of the cloud is forced to move up and around it. The air forced upward, cools and forms the cloud cap. Location: Pileus clouds form in conjunction with strong convective clouds and are associated with the cumulus cloud that lies beneath. These occur in areas with strong heating and lots of moisture close to the ground. This means that they commonly occur over land in areas like the eastern United States and Australia (more likely over the Great Dividing Range and in the northern parts during monsoon season) during spring and summer. Australian Geographic language code: en);
change note: 2013-02-12 11:51:14.0 [mpmorahan] Insert Concept add broader relation (PILEUS [31c8b1d1-1e46-4c40-a23f-0db327121eb7,82157] - TROPOSPHERIC/HIGH-LEVEL CLOUDS (OBSERVED/ANALYZED) [705cd3a0-ea07-40c8-bfa1-9c26f22d13ba,82123]);
in scheme: sciencekeywords
definition: "Appearance: Resembles the top of a mushroom or a smooth cap. Occurrence: Occasional. Found above rapidly growing cumulus or cumulonimbus clouds as a result of warm updrafts formed during a thunderstorm. Conditions: Caused by rapid, relatively strong, upward movements of warm moist air, which acts as a barrier. Air approaching the top of the cloud is forced to move up and around it. The air forced upward, cools and forms the cloud cap. Location: Pileus clouds form in conjunction with strong convective clouds and are associated with the cumulus cloud that lies beneath. These occur in areas with strong heating and lots of moisture close to the ground. This means that they commonly occur over land in areas like the eastern United States and Australia (more likely over the Great Dividing Range and in the northern parts during monsoon season) during spring and summer. Australian Geographic
type: Concept