MA/DPH
in scheme: providers
definition: We are dedicated to our mission, to serve all the people in the Commonwealth, particularly the under served, and to promote healthy people, healthy families, healthy communities and healthy environments through compassionate care, education and prevention. Your health is our concern. Summary Provided By: http://www.mass.gov/dph/dphhome.htm
type: Concept

MASSACHUSETTS
type: Concept