COMMERCIAL
type: Concept

Transvalor Innovation
change note: 2014-04-10 09:04:46.0 [128.183.164.42] insert AltLabel (id: null text: Transvalor Innovation language code: en);
change note: 2014-04-10 09:04:09.0 [128.183.164.42] Insert Concept add broader relation (Transvalor Innovation [343e63c2-9c6d-409b-8488-2dccaab07059,106295] - COMMERCIAL [1bb6821d-8534-40ce-a6ee-7c88ce4d3c9f,66463]);
in scheme: providers
definition: Transvalor is born of Research and has maintained a strong association with the Center for Material Forming (CEMEF), a research center of prestigious MinesParisTech, whose main activities are centered around material forming and numerical computation. This partnership provides a constant flow of advanced scientific developments that translate into innovative new functionalities to Transvalor’s products for the benefit of our customers.
type: Concept