HYDROCARBONS
change note: 2018-03-07 11:12:30.0 [tstevens] insert Definition (id: null text: Organic compounds composed entirely of carbon and hydrogen atoms. language code: en);
change note: 2018-03-07 08:31:44.0 [tstevens] Insert Concept add broader relation (HYDROCARBONS [344cbd30-a2e4-437e-9fc9-5e6b1c484bac,310693] - WATER CHARACTERISTICS [f7e97dc3-1181-41b5-8b90-946eb2504110,310633]);
in scheme: sciencekeywords
definition: Organic compounds composed entirely of carbon and hydrogen atoms.
type: Concept

WATER CHARACTERISTICS
type: Concept