CLOUD RADIATIVE FORCING
change note: 2013-02-14 14:16:45.0 [mpmorahan] Rename Concept update PrefLabel (CLOUD RADIATIVE FORCING);
change note: 2013-02-14 14:15:25.0 [mpmorahan] Move Concepts add broader relation (CLOUD FORCING [345ab082-59ac-4649-9a2a-a3bef0d26a06,63279] - CLOUD RADIATIVE TRANSFER [3487d350-a5a5-43d9-a60d-c1407dd2f0ce,82135]); delete broader relation (null);
in scheme: sciencekeywords
definition: The effect that clouds have on the global radiation budget.
type: Concept

CLOUD RADIATIVE TRANSFER
type: Concept