ATMOSPHERIC CHEMISTRY MODELS
in scheme: sciencekeywords
definition: (A numerical representation of) the chemical constituents of Earth's atmosphere, and the roles they play in influencing the atmosphere's temperature, radiation, and dynamics.
type: Concept

MODELS
type: Concept