USDA
type: Concept

USDA/FS/FHP
in scheme: providers
definition: The USDA Forest Health Protection Service has built an organization of specialists trained to provide technical assistance on forest health-related matters, particularly those related to disturbance agents such as native and non-native insects, pathogens, and plants. We offer specialized assistance to incorporate disturbance considerations into forest plans and decisions. Website: "http://www.fs.fed.us/foresthealth/" [Summary provided by the USDA.]
type: Concept