TEMPEST
change note: 2022-08-23 13:37:35.0 [tstevens] Insert Concept add broader relation (TEMPEST [373ed910-4022-4d08-b6b9-d3e44de61fd5,1026076] - Radiometers [5b753e40-b3f1-426a-8d92-ffee1d675468,1017538]);
change note: 2022-08-23 13:49:17.0 [tstevens] insert WeightedRelation (id: null related concept uuid: 93c5d18c-be62-46c4-9545-42f73a854d85 relationship type: null relationship value: null generated by: null);
change note: 2022-08-23 13:42:21.0 [tstevens] insert AltLabel (id: null category: primary text: Temporal Experiment for Storms and Tropical Systems language code: en); insert Definition (id: null text: The Temporal Experiment for Storms and Tropical Systems (TEMPEST) instrument performs cross-track imaging at five frequencies (89, 166, 176, 180, and 182 GHz). language code: en);
type: Concept
definition: The Temporal Experiment for Storms and Tropical Systems (TEMPEST) instrument performs cross-track imaging at five frequencies (89, 166, 176, 180, and 182 GHz).
in scheme: instruments

Radiometers
type: Concept