GEOMAR/ODSN
in scheme: providers
definition: The Ocean Drilling Stratigraphic Network is intended to facilitate work with the stratigraphic data gathered by the Deep Sea Drilling Project and Ocean Drilling Program by providing access to databases and tools, and communication among researchers. Summary Provided By: http://www.odsn.de/odsn/about.html
type: Concept

CONSORTIA/INSTITUTIONS
type: Concept