DIHM
change note: 2017-02-16 15:39:26.0 [tstevens] update AltLabel (Digital Inline Holographic Microscopy);
change note: 2017-02-16 15:36:09.0 [tstevens] Insert Concept add broader relation (DIHM [396006e9-23ac-48f9-be9f-41cde27f9bbc,278649] - Photon/Optical Detectors [8143e95e-a438-4a2a-82b2-6d7ae079fba7,259347]);
change note: 2017-02-16 15:38:40.0 [tstevens] insert AltLabel (id: null text: Digital Inline Holographic M<icroscopy language code: en); insert Definition (id: null text: Allows fast three-dimensional imaging of microscopic samples, such as swimming microorganisms and soft matter systems with minimal modification to a standard microscope setup. language code: en);
in scheme: instruments
definition: Allows fast three-dimensional imaging of microscopic samples, such as swimming microorganisms and soft matter systems with minimal modification to a standard microscope setup.
type: Concept

Photon/Optical Detectors
type: Concept