CARBON
type: Concept

SOIL ORGANIC CARBON (SOC)
change note: 2020-01-17 19:46:43.0 [sritz] Insert Concept add broader relation (SOIL ORGANIC CARBON (SOC) [39a39084-ae04-421c-892b-f554133ca4e6,559709] - CARBON [a7ae5843-479c-4055-b8fc-ba651e485750,84059]);
in scheme: sciencekeywords
definition: "Soil organic carbon" represents the pool of organic carbon stored in the soil.
type: Concept