DPG
change note: 2012-08-09 08:36:41.0 [tbs1979] Insert Concept add broader relation (DPG [39feceb3-722b-4ddb-935b-0c0e6e80410e,40487] - Pressure/Height Meters [b5f5efbe-5b2a-405d-b1ea-ab6c90028009,32669]);
in scheme: instruments
definition: Deep-Sea Differential Pressure Gauges (DPGs) are pressure gauges capable of accurate measurements of pressures generated directly by long surface gravity waves, tsunami, and microseisms. [Summary provided by the Scripps Institution of Geography.] Group: Instrument_Details Entry_ID: DPG Group: Instrument_Identification Instrument_Category: In Situ/Laboratory Instruments Instrument_Class: Pressure/Height Meters Short_Name: DPG Long_Name: Differential Pressure Gauge End_Group Online_Resource: http://marineemlab.ucsd.edu/instruments/dpgs.html Sample_Image: http://marineemlab.ucsd.edu/instruments/images/DPG1.jpg Creation_Date: 2012-08-09 End_Group
type: Concept

Pressure/Height Meters
type: Concept