OR-STATE/COF
in scheme: providers
definition: The mission of the College of Forestry, as part of Oregon's Land, Sea, and Space Grant University, is to educate and engage the next generation of scholars, practitioners, and users of the world's forest resources, to conduct distinctive problem-solving and fundamental research on the nature and use of forests and related resources, and to share our discoveries and knowledge with others. Summary Provided By: http://www.cof.orst.edu/college.php
type: Concept

ACADEMIC
type: Concept