GLACIAL LANDFORMS
type: Concept

NUNATAKS
change note: 2013-04-01 10:34:40.0 [tbs1979] insert Definition (id: null text: An exposed, often rocky element of a ridge, mountain, or peak not covered with ice or snow within (or at the edge of) an ice field or glacier. The term is typically used in areas where a permanent ice sheet is present. Nunataks present readily identifiable landmark reference points in glaciers or ice caps and are often named. language code: en);
change note: 2013-03-05 08:43:44.0 [tbs1979] Insert Concept add broader relation (NUNATAKS [3b8bdda1-2415-47ea-b4cf-c802fa44c496,82771] - GLACIAL LANDFORMS [3c78951a-0293-4fb0-baff-ec7372fe784d,64133]);
in scheme: sciencekeywords
definition: An exposed, often rocky element of a ridge, mountain, or peak not covered with ice or snow within (or at the edge of) an ice field or glacier. The term is typically used in areas where a permanent ice sheet is present. Nunataks present readily identifiable landmark reference points in glaciers or ice caps and are often named.
type: Concept