TRANSPONDERS
in scheme: instruments
definition: TRANSPONDERS are electrical devices designed to receive a specific signal and automatically transmit a specific reply.
type: Concept

Positioning/Navigation
type: Concept