UI-UC/EX-OR
in scheme: providers
definition: University of Illinois Extension is the flagship outreach effort of the University of Illinois at Urbana-Champaign, offering educational programs to residents of all of Illinois’ 102 counties – and far beyond. Through learning partnerships that put knowledge to work, U of I Extension’s programs are aimed at making life better, healthier, safer and more profitable for individuals and their communities. Summary Provided By: http://web.extension.uiuc.edu/state/whatwedo.html
type: Concept

ACADEMIC
type: Concept