Subsurface
type: Concept

ROVS
change note: 2022-04-20 08:48:33.0 [tstevens] insert AltLabel (id: null category: primary text: Remotely Operated Vehicle language code: en);
change note: 2022-04-20 07:51:22.0 [tstevens] Insert Concept add broader relation (ROVS [3d5edc3b-2f75-45a3-a02e-59b6a88c2652,894382] - Subsurface [31eb34c8-016e-48c4-9404-7d94ee66cfde,884454]);
change note: 2022-04-20 07:52:50.0 [tstevens] insert Definition (id: null text: An ROV is a Remotely Operated Vehicle that is tethered and under the direct control of a human operator at the surface. An ROV can stop, hover, and bring back an object or water sample to the surface using a manipulator arm or other mechanical device. language code: en);
type: Concept
definition: An ROV is a Remotely Operated Vehicle that is tethered and under the direct control of a human operator at the surface. An ROV can stop, hover, and bring back an object or water sample to the surface using a manipulator arm or other mechanical device.
in scheme: platforms