NOSR/NWO/NPP
in scheme: projects
definition: The NPP funds Dutch scientific research in the polar regions, and research about the polar regions (not specifically executed in the polar regions). The assessment of grant applications, implementation and co-ordination of the NPP is the responsibility of the Earth and Life Sciences Department of the Netherlands Organisation for Scientific Research (NWO). http://www.nwo.nl/nwohome.nsf/pages/NWOP_89CEUE_Eng
type: Concept

M - O
type: Concept