NON-GOVERNMENT/NON-PROFIT ORGANIZATIONS
type: Concept

Apache
change note: 2013-11-19 09:52:58.0 [gee-cee] insert AltLabel (id: null text: Apache Software Foundation language code: en);
change note: 2013-11-19 09:52:26.0 [gee-cee] Insert Concept add broader relation (Apache [3e868c6c-5802-414d-b49f-7b991c254169,105929] - NON-GOVERNMENT/NON-PROFIT ORGANIZATIONS [f8762581-b92f-48f9-b077-964ee6b0c8ee,66483]);
in scheme: providers
definition: The Apache Software Foundation, a US 501(3)(c) non-profit corporation, provides organizational, legal, and financial support for a broad range of over 140 open source software projects. The Foundation provides an established framework for intellectual property and financial contributions that simultaneously limits potential legal exposure for our project committers. Through a collaborative and meritocratic development process known as The Apache Way, Apache™ projects deliver enterprise-grade, freely available software products that attract large communities of users. The pragmatic Apache License makes it easy for all users, commercial and individual, to deploy Apache products.
type: Concept