TOTAL TEMPERATURE
in scheme: sciencekeywords
definition: Measurement made using a temperature probe (e.g. thermistor) which is the sum of the ambient air temperature plus the heat of friction caused by the high speed air passing over the probe.
type: Concept

SENSOR CHARACTERISTICS
type: Concept