TECTONICS
type: Concept

NEOTECTONICS
change note: 2017-03-10 11:09:00.0 [tstevens] update Definition (Pertaining to the study of late Cenozoic deformation and the crustal motion that caused that deformation.); update Definition (USGS);
in scheme: sciencekeywords
definition: Pertaining to the study of late Cenozoic deformation and the crustal motion that caused that deformation.
type: Concept