SI-111 Infrared Radiometer
change note: 2021-05-12 09:32:42.0 [tstevens] insert AltLabel (id: null category: primary text: SI-111 Infrared Radiometer with Standard Field of View language code: en); insert Definition (id: null text: The SI-111, manufactured by Apogee, is a precision infrared radiometer that determines the surface temperature of an object without physical contact. It measures both the subject's surface temperature and the sensor-body temperature. A Campbell Scientific data logger uses these measurements to calculate the correct temperature of the subject. language code: en);
change note: 2021-05-12 09:31:49.0 [tstevens] Insert Concept add broader relation (SI-111 Infrared Radiometer [3f26dbe2-27f3-430e-a4da-f61fce22a0fd,606933] - Radiometers [5b753e40-b3f1-426a-8d92-ffee1d675468,598819]);
in scheme: instruments
definition: The SI-111, manufactured by Apogee, is a precision infrared radiometer that determines the surface temperature of an object without physical contact. It measures both the subject's surface temperature and the sensor-body temperature. A Campbell Scientific data logger uses these measurements to calculate the correct temperature of the subject.
type: Concept

Radiometers
type: Concept