Photometers
type: Concept

SPECTROPHOTOMETERS
change note: 2021-08-05 17:29:26.0 [sritz] insert AltLabel (id: null category: primary text: SPECTROPHOTOMETERS language code: en);
in scheme: instruments
definition: SPECTROPHOTOMETERS are photometers that measure the intensity of radiation as a function of frequency (or wavelength) of the radiation; radiation enters the meter through a slit and is dispersed by means of a prism.
type: Concept