STABILITY
change note: 2013-03-13 14:53:03.0 [tbs1979] insert Definition (id: null text: The ability of a mineral to remain unaltered over a stated range of pressure and temperature. language code: en);
change note: 2013-03-07 08:29:16.0 [tbs1979] Insert Concept add broader relation (STABILITY [3ff1adcf-563f-47b3-902e-0231051dc8e7,83127] - METALS PHYSICAL/OPTICAL PROPERTIES [85d46af8-f6ce-490d-a971-0f03b301c1e4,83117]);
in scheme: sciencekeywords
definition: The ability of a mineral to remain unaltered over a stated range of pressure and temperature.
type: Concept

METALS PHYSICAL/OPTICAL PROPERTIES
type: Concept