SYRACUSE/ES
in scheme: providers
definition: The Department of Earth Sciences at Syracuse is a community of scholars with diverse interests in the nature of our planet: environmental geology, wetland hydrogeology, crustal evolution, sedimentology, isotope geochemistry, paleobiology, paleolimnology, and global environmental change. Summary Provided By: http://earthsciences.syr.edu/
type: Concept

ACADEMIC
type: Concept