MAGMA COMPOSITION/TEXTURE
change note: 2013-04-02 09:41:18.0 [tbs1979] update Definition (The composition and texture of molten rock in the earth's crust.); update Definition (Princeton University);
change note: 2013-03-07 09:04:01.0 [tbs1979] update PrefLabel (MAGMA COMPOSITION/TEXTURE);
change note: 2013-03-07 08:55:59.0 [tbs1979] Move Concepts delete broader relation (null); add broader relation (MAGMA [40f0a368-7261-43f7-839c-64e428270442,61655] - ERUPTION DYNAMICS [0db0e1c8-6ba3-40c4-97c2-d78c9812692b,61651]);
in scheme: sciencekeywords
definition: The composition and texture of molten rock in the earth's crust.
type: Concept

ERUPTION DYNAMICS
type: Concept