OCEAN WAVES
type: Concept

ROSSBY/PLANETARY WAVES
change note: 2017-03-15 12:01:43.0 [mgenazzi] Definition added insert Definition (id: null text: A wave on a uniform current in a two-dimensional nondivergent fluid system, rotating with varying angle speed about the local vertical (beta plane). language code: en);
in scheme: sciencekeywords
definition: A wave on a uniform current in a two-dimensional nondivergent fluid system, rotating with varying angle speed about the local vertical (beta plane).
type: Concept