MULTINATIONAL ORGANIZATIONS
type: Concept

IUCN/BOOKSTORE
in scheme: providers
definition: The World Conservation Bookstore is a compilation of titles available from: CITES ? Convention on International Trade in Endangered Species of Wild Fauna and Flora, IUCN ? The World Conservation Union, the Ramsar Convention on Wetlands, TRAFFIC ? the joint wildlife trade monitoring programme of IUCN and WWF, and UNEP-World Conservation Monitoring Centre. Also included are relevant titles from IUCN members or other publishers. A Catalogue with order form is now available for North American and Canadian customers from Island Press ? IUCN's North American Distributor. IUCN Publications Services Unit and IUCN Library have collaborated to make available a unique resource providing information on over 2000 titles spanning more than 50 years. This is the initial stage of what will be a full online ordering system. A new searchable database has now been installed. Website: "http://www.iucn.org/bookstore/" [Summary provided by the World Conservation Bookstore.]
type: Concept