Magnetic Field/Electric Field Instruments
type: Concept

NUCLEAR PRECESSION MAGNETOMETER
change note: 2021-08-04 17:31:03.0 [sritz] insert AltLabel (id: null category: primary text: Scanning Microwave Spectrometer language code: en);
in scheme: instruments
definition: A NUCLEAR PRECESSION MAGNETOMETER is a measuring meter instrument that measures the Earth?s magnetic field intensity with nuclear powered technology.
type: Concept